{"text_format":"1","workbook":"xlsx","n_sheets":7,"sheets":["Secciones","Formato_Catalogos","Busqueda","Consulta","Clausulado","BD_Clausulas","BD"],"not_rendered":{"charts":0,"images":1,"macros":1,"external_links":0,"defined_names":12,"comments":0,"pivot_tables":0},"unopened":[],"bounds":{"document_bytes":16777216,"sheet_cells":100000,"rows_first":2000,"rows_last":500,"rows_between":2000,"halvings":0,"cell_chars":16384,"cell_head_chars":4096},"cells_cut":0,"cells_raw":0,"read":"whole","date_system":"1900"}

{"sheet":"Secciones","index":0,"n_rows":39,"n_cols":5,"rows_kept":39,"cut":false,"hidden":true,"merged":[]}
[1,"I Puebla",null,null,"Otras Modificaciónes"]
[2,"II Nuevo León",null,null,"Nueva Cláusula"]
[3,"III Jalisco",null,null,"Nuevo Catalogo"]
[4,"IV Veracruz Sur",null,null,"Nueva Categoria"]
[5,"V Estado de México",null,null,"Nuevo Artículo"]
[6,"VI Yucatán",null,null,"Nuevo Profesiograma"]
[7,"VII Baja California Norte y San Luis Rio Colorado"]
[8,"VIII Chihuahua"]
[9,"IX Veracruz Norte"]
[10,"X Tamaulipas"]
[11,"XI Sinaloa"]
[12,"XII Coahuila"]
[13,"XIII Sonora"]
[14,"XIV Chiapas"]
[15,"XV Guanajuato"]
[16,"XVI Durango"]
[17,"XVII Guerrero"]
[18,"XVIII San Luis Potosí"]
[19,"XIX Morelos"]
[20,"XX Michoacán"]
[21,"XXI Aguascalientes"]
[22,"XXII Hidalgo"]
[23,"XXIII Querétaro"]
[24,"XXIV Nayarit"]
[25,"XXV Colima"]
[26,"XXVI Tabasco"]
[27,"XXVII Campeche"]
[28,"XXVIII Oaxaca"]
[29,"XXIX Zacatecas"]
[30,"XXX Tlaxcala"]
[31,"XXXI Baja California Sur"]
[32,"XXXII Noroeste del D.F."]
[33,"XXXIII Noreste del D.F."]
[34,"XXXIV Suroeste del D.F."]
[35,"XXXV Sureste del D.F."]
[36,"XXXVI Quintana Roo"]
[37,"XXXVII Estado de México"]
[38,"Modulo Central"]
[39,"Comité Ejecutivo Nacional"]

{"sheet":"Formato_Catalogos","index":1,"n_rows":11,"n_cols":17,"rows_kept":11,"cut":false,"hidden":false,"merged":[[7,10,7,12],[8,2,8,3],[7,2,7,3],[7,5,7,8],[10,11,10,12],[10,2,10,4],[1,16,37,21],[10,6,10,8],[9,2,9,3],[8,10,8,11],[9,11,9,12],[9,9,9,10],[4,2,5,12],[6,13,6,15],[3,13,3,15],[4,13,4,15],[11,1,37,4],[11,5,37,8],[9,5,9,8],[8,5,8,7],[11,9,37,12],[1,2,3,12]]}
[]
[null,null,"Sindicato Nacional de Trabajadores del Seguro Social\nComité Ejecutivo Nacional",null,null,null,null,null,null,null,null,null,null,null,null,null,{"$f":"IF(O8=\"\",\"\",VLOOKUP(O8,Clausulado!$A$2:$H$138,8,FALSE))","v":"Conocimientos de 4o. año de Primaria."}]
[]
[null,null,null,null,null,null,null,null,null,null,null,null,null,"SELECCIONA TU  SECCIÓN"]
[null,null,"LXXI Consejo Nacional Ordinario",null,null,null,null,null,null,null,null,null,null,null,39]
[]
[null,null,null,null,null,null,null,null,null,null,null,"MESA:",{"$f":"IF(O8=\"\",\"\",VLOOKUP(O8,Clausulado!$A$2:$F$139,6,FALSE))","v":3},"No.Requisito"]
[null,"SECCIÓN: ",{"$f":"IF(O5=\"\",\"\",VLOOKUP(O5,Secciones!$A$1:$B$39,2,FALSE))","v":"Comité Ejecutivo Nacional"},null,"NOMBRE : ",null,null,null,null,"CATEGORÍA:",null,null,null,null,1]
[null,"MATRÍCULA:   ",null,null,"ADSCRIPCIÓN: ",null,null,null,"CATALOGO:",{"$f":"IF(O8=\"\",\"\",VLOOKUP(O8,Clausulado!$A$2:$C$139,3,FALSE))","v":"I"},"PONENCIA No."]
[null,"No. REQUISITO:",{"$f":"IF(O8=\"\",\"\",VLOOKUP(O8,Clausulado!$A$2:$G$139,7,FALSE))","v":1},null,"NOMBRE DE GRUPO:",{"$f":"IF(O8=\"\",\"\",VLOOKUP(O8,Clausulado!$A$2:$G$139,4,FALSE))","v":"Catálogo Abierto de Requisitos para ocupar las Plazas del\nTabulador"},null,null,null,"OTRAS MODIFICACIONES:"]
[null,"DICE: ",null,null,null,"DEBE DECIR: ",null,null,null,"JUSTIFICACIÓN: "]

{"sheet":"Busqueda","index":2,"n_rows":12,"n_cols":16,"rows_kept":12,"cut":false,"hidden":true,"merged":[]}
[]
[]
[]
[]
["CONSULTA"]
["Consecutivo Formatos","Mesa","Seccion","Nombre","Categoria","Matricula","Adscripcion","Capitulo","Ponencia Numero","Clausula","Reglamento","Articulo","Otras Modificaciones","Dice Contenido","Debe Decir Contenido","Justificacion Contenido"]
[1]
[]
[]
["REPORTE"]
["Consecutivo Formatos","Mesa","Seccion","Nombre","Categoria","Matricula","Adscripcion","Capitulo","Ponencia Numero","Clausula","Reglamento","Articulo","Otras Modificaciones","Dice Contenido","Debe Decir Contenido","Justificacion Contenido"]
[1,3,"XIII","MARIO MELO BARRERA","COORDINADOR SNTSS",8713561,"NACIONAL","IV","1",26,"INTERIOR DE TRABAJO",6,null,"Los movimientos escalafonarios se regirán por las Cláusulas conducentes de este Contrato y el ","Los movimientos escalafonarios se regirán por las Cláusulas conducentes de este Contrato y el ","POR QUE ASI LO DIGO YO"]

{"sheet":"Consulta","index":3,"n_rows":12,"n_cols":13,"rows_kept":12,"cut":false,"hidden":true,"merged":[[7,2,7,3],[7,5,7,8],[7,10,7,12],[8,2,8,3],[8,5,8,6],[8,8,8,9],[11,1,37,4],[11,5,37,8],[11,9,37,12],[9,2,9,3],[9,5,9,6],[9,8,9,9],[10,2,10,4],[10,6,10,8],[10,11,10,12]]}
[]
[]
[]
[]
[]
[]
[null,null,null,null,null,null,null,null,null,null,null,"MESA:",3]
[null,"SECCIÓN: ","XIII",null,"NOMBRE : ","MARIO MELO BARRERA",null,null,null,"CATEGORÍA:","COORDINADOR SNTSS"]
[null,"MATRÍCULA:   ",8713561,null,"ADSCRIPCIÓN: ","NACIONAL",null,"CAPÍTULO: ","IV",null,"PONENCIA No.",null,"1"]
[null,"CLÁUSULA:",26,null,"REGLAMENTO:","INTERIOR DE TRABAJO",null,"ARTÍCULO:",null,null,"OTRAS MODIFICACIONES:"]
[null,"DICE: ",null,null,null,"DEBE DECIR: ",null,null,null,"JUSTIFICACIÓN: "]
[null,"Los movimientos escalafonarios se regirán por las Cláusulas conducentes de este Contrato y el ",null,null,null,"Los movimientos escalafonarios se regirán por las Cláusulas conducentes de este Contrato y el ",null,null,null,"POR QUE ASI LO DIGO YO"]

{"sheet":"Clausulado","index":4,"n_rows":138,"n_cols":8,"rows_kept":138,"cut":false,"hidden":true,"merged":[]}
["Consecutivo","CLAUSULAS","CAPITULO","TEMA","TITULO","MESA","CLAUSULAS","FRACCION DEL CCT"]
[1,1,"I","Catálogo Abierto de Requisitos para ocupar las Plazas del\nTabulador",null,3,1,"Conocimientos de 4o. año de Primaria."]
[2,2,"I","Catálogo Abierto de Requisitos para ocupar las Plazas del\nTabulador",null,3,2,"Certificado de Instrucción Primaria."]
[3,3,"I","Catálogo Abierto de Requisitos para ocupar las Plazas del\nTabulador",null,3,3,"Conocimientos de Instrucción Secundaria."]
[4,4,"I","Catálogo Abierto de Requisitos para ocupar las Plazas del\nTabulador",null,3,4,"Certificado de Instrucción Secundaria o Prevocacional."]
[5,5,"I","Catálogo Abierto de Requisitos para ocupar las Plazas del\nTabulador",null,3,5,"Certificado de Preparatoria o Vocacional."]
[6,6,"I","Catálogo Abierto de Requisitos para ocupar las Plazas del\nTabulador",null,3,6,"Carta de Pasante de la profesión que requieran sus actividades específicas, expedida por institución oficial reconocida."]
[7,"6A","I","Catálogo Abierto de Requisitos para ocupar las Plazas del\nTabulador",null,3,"6A","Haber cursado como mínimo el 6o. semestre de la licenciatura de Químico-Farmacéutico-Biólogo; Químico-Bacteriólogo-Parasitólogo o Químico Clínico."]
[8,"6B","I","Catálogo Abierto de Requisitos para ocupar las Plazas del\nTabulador",null,3,"6B","Carta de Pasante de nivel Licenciatura"]
[9,7,"I","Catálogo Abierto de Requisitos para ocupar las Plazas del\nTabulador",null,3,7,"Principios de Contabilidad."]
[10,"7A","I","Catálogo Abierto de Requisitos para ocupar las Plazas del\nTabulador",null,3,"7A","Conocimientos de Contabilidad aplicables a la categoría."]
[11,8,"I","Catálogo Abierto de Requisitos para ocupar las Plazas del\nTabulador",null,3,8,"Comprobante  de  haber  cursado  primer  año  de  la  carrera  de Ingeniería o Arquitectura."]
[12,9,"I","Catálogo Abierto de Requisitos para ocupar las Plazas del\nTabulador",null,3,9,"Comprobante de haber cursado el segundo año de la carrera de Ingeniería."]
[13,10,"I","Catálogo Abierto de Requisitos para ocupar las Plazas del\nTabulador",null,3,10,"Conocimientos de Contabilidad Intermedia."]
[14,11,"I","Catálogo Abierto de Requisitos para ocupar las Plazas del\nTabulador",null,3,11,"Conocimientos de Contabilidad Superior."]
[15,12,"I","Catálogo Abierto de Requisitos para ocupar las Plazas del\nTabulador",null,3,12,"Título profesional que requieran sus actividades específicas, expedido por una institución oficial reconocida y registrado por la Dirección de Profesiones."]
[16,"12A","I","Catálogo Abierto de Requisitos para ocupar las Plazas del\nTabulador",null,3,"12A","Título y Cédula profesionales de Licenciatura en Informática o carreras afines a satisfacción del Instituto."]
[17,"12B","I","Catálogo Abierto de Requisitos para ocupar las Plazas del\nTabulador",null,3,"12B","Título y Cédula profesional de Licenciado en Trabajo Social."]
[18,"12C","I","Catálogo Abierto de Requisitos para ocupar las Plazas del\nTabulador",null,3,"12C","Título de Licenciado en Nutrición expedido por una Institución con reconocimiento oficial y Cédula Profesional expedida por la Dirección General de Profesiones de la Secretaría de Educación Pública o por la dependencia equivalente de conformidad con la legislación estatal, en su caso."]
[19,13,"I","Catálogo Abierto de Requisitos para ocupar las Plazas del\nTabulador",null,3,13,"Certificado de curso de posgraduado, expedido por una institución oficial reconocida."]
[20,14,"I","Catálogo Abierto de Requisitos para ocupar las Plazas del\nTabulador",null,3,14,"Un año de ejercicio profesional después de titulado."]
[21,15,"I","Catálogo Abierto de Requisitos para ocupar las Plazas del\nTabulador",null,3,15,"Dos años de ejercicio profesional después de titulado."]
[22,16,"I","Catálogo Abierto de Requisitos para ocupar las Plazas del\nTabulador",null,3,16,"Tres años de ejercicio profesional después de titulado."]
[23,17,"I","Catálogo Abierto de Requisitos para ocupar las Plazas del\nTabulador",null,3,17,"Cuatro años de ejercicio profesional después de titulado."]
[24,18,"I","Catálogo Abierto de Requisitos para ocupar las Plazas del\nTabulador",null,3,18,"Cinco años de ejercicio profesional después de titulado."]
[25,19,"I","Catálogo Abierto de Requisitos para ocupar las Plazas del\nTabulador",null,3,19,"Conocimiento elemental de Organización de Oficinas."]
[26,20,"I","Catálogo Abierto de Requisitos para ocupar las Plazas del\nTabulador",null,3,20,"Conocimiento general de Organización de Oficinas."]
[27,21,"I","Catálogo Abierto de Requisitos para ocupar las Plazas del\nTabulador",null,3,21,"Certificado expedido por institución reconocida, que acredite la especialización de su actividad o su equivalente a satisfacción del Instituto."]
[28,"21A","I","Catálogo Abierto de Requisitos para ocupar las Plazas del\nTabulador",null,3,"21A","Certificado expedido por institución reconocida que acredite la especialización de su actividad, en cursos con una duración de 6 meses."]
[29,"21B","I","Catálogo Abierto de Requisitos para ocupar las Plazas del\nTabulador",null,3,"21B","Certificado expedido por institución reconocida que acredite la especialización de su actividad, en cursos con una duración mínima de 10 meses"]
[30,"21C","I","Catálogo Abierto de Requisitos para ocupar las Plazas del\nTabulador",null,3,"21C","Certificado expedido por institución reconocida que acredite la especialización  en  Administración,  en  cursos  con  una  duración mínima de 6 meses."]
[31,"21D","I","Catálogo Abierto de Requisitos para ocupar las Plazas del\nTabulador",null,3,"21D","Constancia  expedida  por  el  Instituto  Mexicano  del  Seguro Social, que acredite la especialidad en Cirugía Bucodento-Maxilar o Máxilo-Facial"]
[32,"21F","I","Catálogo Abierto de Requisitos para ocupar las Plazas del\nTabulador",null,3,"21F","Título de estudios a Nivel Técnico Profesional, expedido por una institución oficial reconocida, en curso con duración mínima de seis semestres."]
[33,"21G","I","Catálogo Abierto de Requisitos para ocupar las Plazas del\nTabulador",null,3,"21G","Certificado expedido por institución reconocida que acredite la especialización en Administración y Docencia, en cursos con duración mínima de 10 meses o maestría en Salud Pública o maestría en Ciencias de la Salud."]
[34,"21H","I","Catálogo Abierto de Requisitos para ocupar las Plazas del\nTabulador",null,3,"21H","Acreditar el Curso Postécnico de Gestión y Educación en Nutrición Clínica con duración de 12 meses, impartido por el Instituto Mexicano del Seguro Social."]
[35,22,"I","Catálogo Abierto de Requisitos para ocupar las Plazas del\nTabulador",null,3,22,"Conocimiento especializado en las labores de la dependencia."]
[36,23,"I","Catálogo Abierto de Requisitos para ocupar las Plazas del\nTabulador",null,3,23,"Autorización expedida  por  la  Secretaría  de  Salud,  o  carta  de pasante, o título de Farmacéutico o Químico Farmacobiólogo."]
[37,24,"I","Catálogo Abierto de Requisitos para ocupar las Plazas del\nTabulador",null,3,24,"Autorización de la Secretaría de Comunicaciones y Transportes."]
[38,25,"I","Catálogo Abierto de Requisitos para ocupar las Plazas del\nTabulador",null,3,25,"Autorización expedida por el Departamento del Distrito Federal, o autoridades correspondientes en los Estados y tarjeta de salud."]
[39,26,"I","Catálogo Abierto de Requisitos para ocupar las Plazas del\nTabulador",null,3,26,"Licencia de  primera con  más  de  cinco  años  de  expedición y comprobante de haber asistido a cursos de Educación Vial."]
[40,"26A","I","Catálogo Abierto de Requisitos para ocupar las Plazas del\nTabulador",null,3,"26A","Licencia de manejo"]
[41,27,"I","Catálogo Abierto de Requisitos para ocupar las Plazas del\nTabulador",null,3,27,"Examen de capacidad y ejecución práctica de las labores a su cargo con las características que en cada caso requierean."]
[42,28,"I","Catálogo Abierto de Requisitos para ocupar las Plazas del\nTabulador",null,3,28,"Un año en la categoría inmediata inferior."]
[43,29,"I","Catálogo Abierto de Requisitos para ocupar las Plazas del\nTabulador",null,3,29,"Un año de práctica."]
[44,30,"I","Catálogo Abierto de Requisitos para ocupar las Plazas del\nTabulador",null,3,30,"Suprimida."]
[45,31,"I","Catálogo Abierto de Requisitos para ocupar las Plazas del\nTabulador",null,3,31,"Conocimientos de la organización y funcionamiento del Instituto Mexicano del Seguro Social."]
[46,32,"I","Catálogo Abierto de Requisitos para ocupar las Plazas del\nTabulador",null,3,32,"Conocimiento de la Ley del Seguro Social y sus Reglamentos."]
[47,33,"I","Catálogo Abierto de Requisitos para ocupar las Plazas del\nTabulador",null,3,33,"Conocimientos del Contrato Colectivo de Trabajo y Reglamentos Especiales de Actividades; Reglamento de Escalafón; Reglamento Interior  de  Trabajo, requisitos, relaciones de  mando,  movimientos escalafonarios y actividades consignadas en el Tabulador."]
[48,34,"I","Catálogo Abierto de Requisitos para ocupar las Plazas del\nTabulador",null,3,34,"Comprobación de buenos antecedentes"]
[49,35,"I","Catálogo Abierto de Requisitos para ocupar las Plazas del\nTabulador",null,3,35,"Condiciones físicas normales."]
[50,36,"I","Catálogo Abierto de Requisitos para ocupar las Plazas del\nTabulador",null,3,36,"Condiciones físicas excelentes."]
[51,37,"I","Catálogo Abierto de Requisitos para ocupar las Plazas del\nTabulador",null,3,37,"Edad de 16 a 30 años."]
[52,"37A","I","Catálogo Abierto de Requisitos para ocupar las Plazas del\nTabulador",null,3,"37A","Edad de 20 a 35 años.."]
[53,"37B","I","Catálogo Abierto de Requisitos para ocupar las Plazas del\nTabulador",null,3,"37B","Edad de 20 a 30 años."]
[54,38,"I","Catálogo Abierto de Requisitos para ocupar las Plazas del\nTabulador",null,3,38,"Edad de 18 a 40 años."]
[55,"38A","I","Catálogo Abierto de Requisitos para ocupar las Plazas del\nTabulador",null,3,"38A","Edad de 24 a 35 años."]
[56,39,"I","Catálogo Abierto de Requisitos para ocupar las Plazas del\nTabulador",null,3,39,"Edad 25 a 46 años."]
[57,40,"I","Catálogo Abierto de Requisitos para ocupar las Plazas del\nTabulador",null,3,40,"Sexo Masculino."]
[58,41,"I","Catálogo Abierto de Requisitos para ocupar las Plazas del\nTabulador",null,3,41,"Sexo Femenino."]
[59,42,"I","Catálogo Abierto de Requisitos para ocupar las Plazas del\nTabulador",null,3,42,"Constancia expedida por el Instituto Mexicano del Seguro Social, que acredite el haber aprobado el curso de Fogonero."]
[60,"42A","I","Catálogo Abierto de Requisitos para ocupar las Plazas del\nTabulador",null,3,"42A","Constancia expedida por el Instituto Mexicano del Seguro Social que acredite el haber aprobado el curso de Operador de Generadores de Vapor."]
[61,43,"I","Catálogo Abierto de Requisitos para ocupar las Plazas del\nTabulador",null,3,43,"Curriculum Vitae a satisfacción del Instituto."]
[62,44,"I","Catálogo Abierto de Requisitos para ocupar las Plazas del\nTabulador",null,3,44,"Conocimientos teórico-prácticos del equipo electromecánico."]
[63,"44A","I","Catálogo Abierto de Requisitos para ocupar las Plazas del\nTabulador",null,3,"44A","Grabación en cintas magnéticas, discos y casetes para procesamiento de datos."]
[64,45,"I","Catálogo Abierto de Requisitos para ocupar las Plazas del\nTabulador",null,3,45,"Haber aprobado un curso de capacitación en su especialidad de los establecidos en el Centro de Capacitación y practicar durante un mes como mínimo en esa nueva especialidad."]
[65,46,"I","Catálogo Abierto de Requisitos para ocupar las Plazas del\nTabulador",null,3,46,"Haber tomado el curso de capacitación de ingreso."]
[66,"46A","I","Catálogo Abierto de Requisitos para ocupar las Plazas del\nTabulador",null,3,"46A","Haber aprobado satisfactoriamente el curso que imparte el Instituto sobre técnicas de especialidad o bien demostrar a satisfacción del  mismo, haber  realizado estudios equivalentes en  otras dependencias oficiales o descentralizadas."]
[67,47,"I","Catálogo Abierto de Requisitos para ocupar las Plazas del\nTabulador",null,3,47,"Haber aprobado un curso de capacitación de otra especialidad diferente a la que venía desempeñando, en los cursos establecidos en el Centro de Capacitación o practicar esa nueva especialidad durante un período no menor de tres meses."]
[68,48,"I","Catálogo Abierto de Requisitos para ocupar las Plazas del\nTabulador",null,3,48,"Suprimido."]
[69,49,"I","Catálogo Abierto de Requisitos para ocupar las Plazas del\nTabulador",null,3,49,"Certificado de carrera comercial o su equivalente que incluya las siguientes materias: Redacción y Documentación, Mecanografía, Taquigrafía, Archivonomía y equipos de registro y nociones de Contabilidad."]
[70,50,"I","Catálogo Abierto de Requisitos para ocupar las Plazas del\nTabulador",null,3,50,"Capacitación previa al ingreso sobre operación de máquinas y equipos de oficina."]
[71,51,"I","Catálogo Abierto de Requisitos para ocupar las Plazas del\nTabulador",null,3,51,"Haber aprobado un curso de capacitación sobre conocimientos, habilidades  o   destrezas  y  responsabilidades  sobre  la  categoría, relativos a las actividades del área de adscripción de la plaza."]
[72,52,"I","Catálogo Abierto de Requisitos para ocupar las Plazas del\nTabulador",null,3,52,"Conocimientos intermedios de Archivonomía."]
[73,53,"I","Catálogo Abierto de Requisitos para ocupar las Plazas del\nTabulador",null,3,53,"Conocimientos superiores de Archivonomía.."]
[74,54,"I","Catálogo Abierto de Requisitos para ocupar las Plazas del\nTabulador",null,3,54,"Conocimientos superiores de Organización de Oficinas."]
[75,55,"I","Catálogo Abierto de Requisitos para ocupar las Plazas del\nTabulador",null,3,55,"Conocimientos superiores de Organización y Administración de Oficinas."]
[76,56,"I","Catálogo Abierto de Requisitos para ocupar las Plazas del\nTabulador",null,3,56,"Conocimientos elementales sobre Organización y Administración de Almacenes."]
[77,57,"I","Catálogo Abierto de Requisitos para ocupar las Plazas del\nTabulador",null,3,57,"Conocimientos intermedios de Metodología Estadística."]
[78,58,"I","Catálogo Abierto de Requisitos para ocupar las Plazas del\nTabulador",null,3,58,"Metodología Estadística."]
[79,59,"I","Catálogo Abierto de Requisitos para ocupar las Plazas del\nTabulador",null,3,59,"Conocimientos intermedios de Matemáticas para Estadística."]
[80,60,"I","Catálogo Abierto de Requisitos para ocupar las Plazas del\nTabulador",null,3,60,"Conocimientos de Matemáticas para Estadística."]
[81,61,"I","Catálogo Abierto de Requisitos para ocupar las Plazas del\nTabulador",null,3,61,"Elementos de Teoría de la Probabilidad."]
[82,62,"I","Catálogo Abierto de Requisitos para ocupar las Plazas del\nTabulador",null,3,62,"Elementos de Demografía."]
[83,63,"I","Catálogo Abierto de Requisitos para ocupar las Plazas del\nTabulador",null,3,63,"Manejo de máquinas de calcular y de escritorio de que disponga la dependencia."]
[84,64,"I","Catálogo Abierto de Requisitos para ocupar las Plazas del\nTabulador",null,3,64,"Programación para la operación de las máquinas de cálculo de que disponga la dependencia."]
[85,65,"I","Catálogo Abierto de Requisitos para ocupar las Plazas del\nTabulador",null,3,65,"Conocimientos elementales de Matemáticas Financieras."]
[86,66,"I","Catálogo Abierto de Requisitos para ocupar las Plazas del\nTabulador",null,3,66,"Conocimientos intermedios de Matemáticas Financieras."]
[87,67,"I","Catálogo Abierto de Requisitos para ocupar las Plazas del\nTabulador",null,3,67,"Conocimientos intermedios de Cálculo Actuarial."]
[88,68,"I","Catálogo Abierto de Requisitos para ocupar las Plazas del\nTabulador",null,3,68,"Cálculo Diferencial e Integral."]
[89,69,"I","Catálogo Abierto de Requisitos para ocupar las Plazas del\nTabulador",null,3,69,"Contabilidad de Seguros."]
[90,70,"I","Catálogo Abierto de Requisitos para ocupar las Plazas del\nTabulador",null,3,70,"Estadística Matemática Intermedia."]
[91,71,"I","Catálogo Abierto de Requisitos para ocupar las Plazas del\nTabulador",null,3,71,"Demografía."]
[92,72,"I","Catálogo Abierto de Requisitos para ocupar las Plazas del\nTabulador",null,3,72,"Métodos Numéricos"]
[93,73,"I","Catálogo Abierto de Requisitos para ocupar las Plazas del\nTabulador",null,3,73,"Conocimientos Intermedios de Econmía."]
[94,74,"I","Catálogo Abierto de Requisitos para ocupar las Plazas del\nTabulador",null,3,74,"Haber cursado Contabilidad Intermedia en una institución oficialmente reconocida o su equivalente a satisfacción del Instituto, siendo objeto de evaluación."]
[95,75,"I","Catálogo Abierto de Requisitos para ocupar las Plazas del\nTabulador",null,3,75,"Operación de máquinas de registro contable."]
[96,76,"I","Catálogo Abierto de Requisitos para ocupar las Plazas del\nTabulador",null,3,76,"Haber cursado hasta Contabilidad Superior en una institución oficialmente reconocida o su equivalente a satisfacción del Instituto."]
[97,77,"I","Catálogo Abierto de Requisitos para ocupar las Plazas del\nTabulador",null,3,77,"Conocimiento teórico práctos de Equipos Periféricos de Sistemas de Capturas de Datos."]
[98,78,"I","Catálogo Abierto de Requisitos para ocupar las Plazas del\nTabulador",null,3,78,"Ser oriundo de la localidad."]
[99,79,"I","Catálogo Abierto de Requisitos para ocupar las Plazas del\nTabulador",null,3,79,"Dominio del dialecto de la localidad."]
[100,80,"I","Catálogo Abierto de Requisitos para ocupar las Plazas del\nTabulador",null,3,80,"Conocimiento de la organización y funcionamiento del Programa IMSS-Prospera."]
[101,81,"I","Catálogo Abierto de Requisitos para ocupar las Plazas del\nTabulador",null,3,81,"Licencia para conducir tipo \"A\", con más de dos años de expedición."]
[102,1,"II","Catálogo Abierto de Relaciones de Mando",null,3,1,"Directas del Jefe del Departamento."]
[103,2,"II","Catálogo Abierto de Relaciones de Mando",null,3,2,"Directas del Jefe de la Oficina."]
[104,3,"II","Catálogo Abierto de Relaciones de Mando",null,3,3,"Directas del Jefe de la Dependencia."]
[105,4,"II","Catálogo Abierto de Relaciones de Mando",null,3,4,"Directas del Director o Jefe de Unidad."]
[106,"4A","II","Catálogo Abierto de Relaciones de Mando",null,3,"4A","Directas del Médico Coordinador del Sistema Médico Familiar."]
[107,5,"II","Catálogo Abierto de Relaciones de Mando",null,3,5,"Directas del Administrador."]
[108,6,"II","Catálogo Abierto de Relaciones de Mando",null,3,6,"Directas del Responsable del Servicio."]
[109,7,"II","Catálogo Abierto de Relaciones de Mando",null,3,7,"Directas del Jefe de la Sección."]
[110,8,"II","Catálogo Abierto de Relaciones de Mando",null,3,8,"Directas de los Médicos tratantes, internos o de guardia."]
[111,9,"II","Catálogo Abierto de Relaciones de Mando",null,3,9,"Directas de la Jefe de Enfermeras"]
[112,"9A","II","Catálogo Abierto de Relaciones de Mando",null,3,"9A","Directas de la Enfermera Jefe de Piso y Subjefe de Enfermeras."]
[113,10,"II","Catálogo Abierto de Relaciones de Mando",null,3,10,"Directas de la Jefe de Parteras."]
[114,11,"II","Catálogo Abierto de Relaciones de Mando",null,3,11,"Directas del Jefe de Laboratorio de Análisis Clínicos, del Jefe de Laboratorio de Analítica y Control o del Jefe del Laboratorio de Producción."]
[115,12,"II","Catálogo Abierto de Relaciones de Mando",null,3,12,"Directas del Superintendente."]
[116,13,"II","Catálogo Abierto de Relaciones de Mando",null,3,13,"Directas del Intendente."]
[117,14,"II","Catálogo Abierto de Relaciones de Mando",null,3,14,"Directas del Oficial de Servicios de Intendencia."]
[118,15,"II","Catálogo Abierto de Relaciones de Mando",null,3,15,"Directas del Oficial de Servicios de Dietología."]
[119,16,"II","Catálogo Abierto de Relaciones de Mando",null,3,16,"Directas del Jefe de Taller, Maestro de la Especialidad o Jefe de Planta de Calderas."]
{"$rows_left_out":19}
{"sheet":"BD_Clausulas","index":5,"n_rows":1,"n_cols":16,"rows_kept":1,"cut":false,"hidden":false,"merged":[]}
["Consecutivo Formatos","Mesa","Seccion","Nombre","Categoria","Matricula","Adscripcion","Capitulo","Ponencia Numero","Clausula","Reglamento","Articulo","Otras Modificaciones","Dice Contenido","Debe Decir Contenido","Justificacion Contenido"]

{"sheet":"BD","index":6,"n_rows":1,"n_cols":16,"rows_kept":1,"cut":false,"hidden":true,"merged":[]}
["Consecutivo Formatos","Mesa","Seccion","Nombre","Categoria","Matricula","Adscripcion","Capitulo","Ponencia Numero","Clausula","Reglamento","Articulo","Otras Modificaciones","Dice Contenido","Debe Decir Contenido","Justificacion Contenido"]