{"text_format":"1","workbook":"xlsx","n_sheets":15,"sheets":["Reglamentos H5","Reglamentos H4","Reglamentos H3","Reglamentos H2","Reg_Act_Depor","Reglamentos H1","Reg_Bec_Cap","Reg_Bol_Trab","Reg_Bol_Trab_IMSSop","Reg_Cal_Conf_B","Busqueda","BD_Clausulas","BD","Consulta","Secciones"],"not_rendered":{"charts":0,"images":1,"macros":1,"external_links":0,"defined_names":16,"comments":0,"pivot_tables":0},"unopened":[],"bounds":{"document_bytes":16777216,"sheet_cells":100000,"rows_first":2000,"rows_last":500,"rows_between":2000,"halvings":0,"cell_chars":16384,"cell_head_chars":4096},"cells_cut":0,"cells_raw":0,"read":"whole","date_system":"1900"}

{"sheet":"Reglamentos H5","index":0,"n_rows":33,"n_cols":8,"rows_kept":33,"cut":false,"hidden":true,"merged":[]}
[1,5,"15 Y 4 TRANSITORIA","REGLAMENTO PARA LA CALIFICACIÓN Y SELECCIÓN DE PUESTOS DE CONFIANZA \"B\"","Cap. I",1,"El   presente  Reglamento,  de   conformidad  con  las Cláusulas 11 y 12 del Contrato Colectivo de Trabajo, determina los lineamientos generales que deben aplicarse para la calificación, selección y ocupación de puestos de Confianza \"B\".",1]
[2,5,"16 Y 4 TRANSITORIA","REGLAMENTO PARA LA CALIFICACIÓN Y SELECCIÓN DE PUESTOS DE CONFIANZA \"B\"","Cap. I",2,"La Calificación de Puestos de Confianza \"B\" tiene como propósito fundamental fortalecer la carrera Institucional de los trabajadores que cuenten con Base o Confianza “B” y promoverlos a puestos de mayor nivel de responsabilidad.\nSon puestos Calificados como de Confianza \"B\", los señalados en el\nCapítulo VII del presente Reglamento, y los que en el futuro califique la Comisión Nacional Mixta para la Calificación y Selección de Puestos de Confianza \"B\".",1]
[3,5,"17 Y 4 TRANSITORIA","REGLAMENTO PARA LA CALIFICACIÓN Y SELECCIÓN DE PUESTOS DE CONFIANZA \"B\"","Cap. I",3,"Para efecto de calificar los puestos de Confianza como de Confianza \"B\" y establecer los requisitos a cubrir para su ocupación, la Comisión Nacional Mixta para la Calificación y Selección de Puestos de Confianza \"B\", realizará con la participación del  Área Normativa correspondiente, el análisis de las funciones de los puestos autorizados dentro de la estructura.",1]
[4,5,"18 Y 4 TRANSITORIA","REGLAMENTO PARA LA CALIFICACIÓN Y SELECCIÓN DE PUESTOS DE CONFIANZA \"B\"","Cap. I",4,"La Coordinación de Personal proporcionará a la Comisión Nacional Mixta para la Calificación y Selección de Puestos de Confianza \"B\", la estructura orgánica y funcional de aquellas áreas en las que se modifique ésta, a fin de actualizar el Catálogo de Puestos de Confianza \"B\".",1]
[5,5,"19 Y 4 TRANSITORIA","REGLAMENTO PARA LA CALIFICACIÓN Y SELECCIÓN DE PUESTOS DE CONFIANZA \"B\"","Cap. I",5,"El Instituto se obliga a promover conforme a sus requerimientos, la  ocupación de  las  plazas  vacantes definitivas en puestos de Confianza \"B\", las cuales sólo podrán ocuparse por el Instituto en forma interina con personal que cuente con Base o Confianza “B” una vez que la vacante sea puesta a disposición de la Comisión Nacional, Subcomisión Mixta o Responsable Operativo y en tanto se concluye el proceso correspondiente, en un plazo no mayor de\n60 días.",1]
[6,5,"20 Y 4 TRANSITORIA","REGLAMENTO PARA LA CALIFICACIÓN Y SELECCIÓN DE PUESTOS DE CONFIANZA \"B\"","Cap. II",6,"Se entiende por Convocatoria, el documento mediante el cual la Comisión Nacional Mixta para la Calificación y Selección de Puestos de Confianza \"B\", Subcomisión Mixta o  Responsables de Operación de Selección de Puestos de Confianza \"B\", dan a conocer a los trabajadores de base y Confianza “B” del Instituto la existencia de vacantes en Puestos de Confianza \"B\", o bien para integrar Bancos de Recursos Humanos con trabajadores de base y Confianza “B”, conforme a los requerimientos del propio Instituto.",1]
{"$rows_left_out":28}
{"sheet":"Reglamentos H4","index":1,"n_rows":68,"n_cols":8,"rows_kept":68,"cut":false,"hidden":true,"merged":[]}
[1,4,"20 TRANSITORIA","REGLAMENTO DE BOLSA DE TRABAJO PARA LOS TRABAJADORES DEL PROGRAMA IMSS-PROSPERA","Cap. II",1,"El ingreso de trabajadores de base, a obra determinada o sustitutos, se hará invariablemente a través de las Bolsas de Trabajo en donde opera el Programa IMSS-Prospera, establecidas en los términos de este Reglamento.",3]
[2,4,"20 TRANSITORIA","REGLAMENTO DE BOLSA DE TRABAJO PARA LOS TRABAJADORES DEL PROGRAMA IMSS-PROSPERA","Cap. II",2,"Para los efectos de este Reglamento se entenderá por Bolsa de Trabajo el organismo que opera el registro de propuestas sindicales, de candidatos y su nominación para ocupar plazas vacantes de las categorías del Programa IMSS-Prospera.",3]
[3,4,"20 TRANSITORIA","REGLAMENTO DE BOLSA DE TRABAJO PARA LOS TRABAJADORES DEL PROGRAMA IMSS-PROSPERA","Cap. II",3,"Se entenderá por aspirante a la persona propuesta para ingresar a la Bolsa de Trabajo en las Delegaciones donde opere el Programa IMSS-Prospera.",3]
[4,4,"20 TRANSITORIA","REGLAMENTO DE BOLSA DE TRABAJO PARA LOS TRABAJADORES DEL PROGRAMA IMSS-PROSPERA","Cap. II",4,"Para la categoría de Auxiliar de Área Médica en UMC en Unidades Médico Rurales, a fin de preservar los usos y costumbres de las   Comunidades   el   Sindicato   otorgará   solamente   propuestas sindicales aquellas aspirantes elegidas por la Asamblea General de las localidades del universo de trabajo, lo cual será comunicado a través del Jefe de Prestaciones Médicas Delegacional a la Sección Sindical para la emisión de la propuesta sindical respectiva.",3]
[5,4,"20 TRANSITORIA","REGLAMENTO DE BOLSA DE TRABAJO PARA LOS TRABAJADORES DEL PROGRAMA IMSS-PROSPERA","Cap. II",5,"Son candidatos los aspirantes calificados que hayan aprobado todos y cada uno de los requisitos exigidos por los Profesiogramas así como el proceso de nuevo ingreso, con respecto a la categoría de que se trate; los trabajadores que soliciten cambios de turno y/o adscripción o de residencia, son candidatos que no requieren ser calificados.",3]
[6,4,"20 TRANSITORIA","REGLAMENTO DE BOLSA DE TRABAJO PARA LOS TRABAJADORES DEL PROGRAMA IMSS-PROSPERA","Cap. II",6,"Habrá Bolsas de Trabajo en las sedes de las Delegaciones Regionales, Estatales y del Distrito Federal en las que opera el Programa IMSS-Prospera.",3]
{"$rows_left_out":63}
{"sheet":"Reglamentos H3","index":2,"n_rows":70,"n_cols":8,"rows_kept":70,"cut":false,"hidden":true,"merged":[]}
[1,3,"22 BIS","REGLAMENTO DE BOLSA DE TRABAJO","Cap. I",1,"El ingreso de trabajadores de base, a obra determinada o sustitutos, se hará invariablemente a través de las Bolsas de Trabajo, establecidas en los términos de este Reglamento en todo el sistema.",3]
[2,3,"22 BIS","REGLAMENTO DE BOLSA DE TRABAJO","Cap. I",2,"Para los efectos de este Reglamento se entenderá por Bolsa de Trabajo el organismo que opera el registro de propuestas sindicales, de candidatos y su nominación para ocupar plazas vacantes y de nueva creación, en categorías autónomas o de pie de rama.",3]
[3,3,"22 BIS","REGLAMENTO DE BOLSA DE TRABAJO","Cap. I",3,"Se entenderá por aspirante a la persona propuesta para ingresar a la Bolsa de Trabajo.\nLos  aspirantes podrán  ser  trabajadores en  servicio  del  Instituto  o personas que no laboren en él.",3]
[4,3,"22 BIS","REGLAMENTO DE BOLSA DE TRABAJO","Cap. I",4,"Son candidatos los aspirantes calificados que hayan satisfecho todos y cada uno de los requisitos exigidos por el Contrato Colectivo de Trabajo, con respecto a la categoría autónoma o de pie de rama de que se trate, y que hayan aprobado las pruebas de ingreso relativas. Los trabajadores que soliciten cambios de área, turno y/o adscripción, ampliación de jornada o de residencia, son candidatos que no requieren ser calificados.\nSe entenderá por área la codificación presupuestal donde las plazas tengan incluidos los conceptos de pago 12, 14, 23, 54, 61 y/o 63.",3]
[5,3,"22 BIS","REGLAMENTO DE BOLSA DE TRABAJO","Cap. I",5,"Para los efectos de este Reglamento se considera pie de rama a la primera categoría de una rama de trabajo con movimientos escalafonarios, y categorías autónomas a las señaladas de esta manera en el tabulador de sueldos del Contrato Colectivo de Trabajo.",3]
[6,3,"22 BIS","REGLAMENTO DE BOLSA DE TRABAJO","Cap. I",6,"Habrá Bolsas de Trabajo en las sedes de las Delegaciones Regionales, Estatales y del Distrito Federal y Nivel Central cuando la operación lo requiera, se establecerán oficinas operativas de Bolsa de Trabajo en Delegaciones del Distrito Federal, y en Subdelegaciones, localidades o  unidades de todo el sistema, previo Acuerdo de los Representantes de la Comisión Nacional Mixta de Bolsa de Trabajo, los que determinarán la operación de cada una de ellas.",3]
{"$rows_left_out":65}
{"sheet":"Reglamentos H2","index":3,"n_rows":33,"n_cols":8,"rows_kept":33,"cut":false,"hidden":true,"merged":[]}
[1,2,112,"REGLAMENTO DE BECAS PARA LA CAPACITACIÓN DE LOS TRABAJADORES DEL SEGURO SOCIAL","Cap. I",1,"Para los efectos de este Reglamento, se entenderá por beca, la aportación económica, los permisos con salario, con parte proporcional del mismo o sin salario, y la reducción de jornada sin perjuicio del salario, que otorga el Instituto a los trabajadores a que se refiere la Cláusula 11 del Contrato Colectivo de Trabajo, de conformidad con las disposiciones que se establecen en los siguientes Artículos.",5]
[2,2,112,"REGLAMENTO DE BECAS PARA LA CAPACITACIÓN DE LOS TRABAJADORES DEL SEGURO SOCIAL","Cap. I",2,"El otorgamiento de becas persigue los propósitos fundamentales siguientes:\nI. Elevar la cultura general, aumentar los conocimientos y mejorar el rendimiento del personal del Instituto;\nII.   Incrementar   la   preparación   y   formar   el   personal   técnico, profesional y especializado de acuerdo con las necesidades presentes\ny las que para el futuro requiera el Instituto;\nIII. Formar el personal directivo que la Institución requiera;\nIV.  Estimular  el  esfuerzo,  el  sentido  de  responsabilidad  y  la dedicación de los trabajadores del Instituto en el desempeño de sus labores al servicio de éste; y\nV. Contribuir a mejorar la atención a los derechohabientes.",5]
[3,2,112,"REGLAMENTO DE BECAS PARA LA CAPACITACIÓN DE LOS TRABAJADORES DEL SEGURO SOCIAL","Cap. I",3,"El Director General del Instituto, o quien designe, en el mes de octubre de cada año, acordará con las Direcciones los programas   elaborados   por   la   Comisión   Nacional   Mixta   de Capacitación  y  Adiestramiento, de  los  cursos  de  capacitación,  de actualización y postgrado que se impartirán en el año siguiente.\nEstos cursos estarán dirigidos a cubrir la necesidad de capacitación del personal de acuerdo a las necesidades del Instituto. En el propio mes de octubre, esas decisiones se comunicarán a la Comisión Nacional Mixta  de  Becas  y  se  publicarán  los  avisos  correspondientes para conocimiento del personal del Instituto.",5]
[4,2,112,"REGLAMENTO DE BECAS PARA LA CAPACITACIÓN DE LOS TRABAJADORES DEL SEGURO SOCIAL","Cap. I",4,"El Director General del Instituto, o quien designe en el mes de octubre de cada año, teniendo en cuenta las necesidades técnicas y las posibilidades presupuestales, determinará el número y categorías de becas que se otorgarán en el mismo año. Simultáneamente, señalará    las disciplinas para las cuales se concederán las becas. En el mismo mes de octubre, se pondrán en conocimiento   de   la   Comisión   Nacional   Mixta   de   Becas   esas decisiones, para que se den a conocer a los trabajadores, y se proceda a aplicar las mismas.",5]
[5,2,112,"REGLAMENTO DE BECAS PARA LA CAPACITACIÓN DE LOS TRABAJADORES DEL SEGURO SOCIAL","Cap. I",5,"Las Direcciones coadyuvarán a la realización de los propósitos a que se refiere el Artículo 2, promoviendo la creación de cursos de orientación técnica, preferentemente de índole práctica, y orientados hacia la enseñanza objetiva.\n Los programas y duración de los cursos, así como el personal que los imparta y las unidades en que se proporcionen, se determinarán por las   partes,   procurando   que   los   horarios,   en   lo   posible,   sean compatibles con las labores que desempeñan en el Instituto los trabajadores a quienes vayan dedicados.",5]
[6,2,112,"REGLAMENTO DE BECAS PARA LA CAPACITACIÓN DE LOS TRABAJADORES DEL SEGURO SOCIAL","Cap. II",6,"Las becas serán de las siguientes clases:\nI. Becas íntegras para el extranjero o para la República; II. Becas parciales para el extranjero o para la República; III. Becas con goce de salario;\nIV. Becas sin goce de salario; y\nV. Becas de reducción de jornada.",5]
{"$rows_left_out":28}
{"sheet":"Reg_Act_Depor","index":4,"n_rows":11,"n_cols":16,"rows_kept":11,"cut":false,"hidden":false,"merged":[[4,2,5,12],[1,15,37,19],[9,4,9,7],[10,2,10,4],[10,6,10,8],[10,11,10,12],[11,1,37,4],[11,5,37,8],[11,9,37,12],[7,2,7,3],[7,5,7,8],[7,10,7,12],[8,2,8,3],[8,5,8,6],[8,8,8,9],[9,11,9,12],[1,2,3,12]]}
[]
[null,null,"Sindicato Nacional de Trabajadores del Seguro Social\nComité Ejecutivo Nacional",null,null,null,null,null,null,null,null,null,null,null,null,{"$f":"IF(O8=\"\",\"\",VLOOKUP(O8,'Reglamentos H1'!$A$1:$G$1153,7,FALSE))","v":"Los trabajadores de base, a obra determinada, sustitutos y sus padres, hijos  y cónyuge tendrán derecho de  hacer uso  de  las instalaciones deportivas del Instituto, dentro de los horarios y normas establecidas para su funcionamiento, con la sola presentación de la credencial que para tal efecto, expida la Comisión Nacional de Deportes y las de las Secciones y Delegaciones Foráneas Autónomas del Sindicato Nacional de Trabajadores del Seguro Social."}]
[]
[null,null,null,null,null,null,null,null,null,null,null,null,null,null,"SELECCIONA TU  SECCIÓN"]
[null,null,"LXXI Consejo Nacional Ordinario",null,null,null,null,null,null,null,null,null,null,null,39]
[]
{"$rows_left_out":6}
{"sheet":"Reglamentos H1","index":5,"n_rows":8,"n_cols":8,"rows_kept":8,"cut":false,"hidden":true,"merged":[]}
[1,1,118,"REGLAMENTO DE ACTIVIDADES DEPORTIVAS","S/C",1,"Los trabajadores de base, a obra determinada, sustitutos y sus padres, hijos  y cónyuge tendrán derecho de  hacer uso  de  las instalaciones deportivas del Instituto, dentro de los horarios y normas establecidas para su funcionamiento, con la sola presentación de la credencial que para tal efecto, expida la Comisión Nacional de Deportes y las de las Secciones y Delegaciones Foráneas Autónomas del Sindicato Nacional de Trabajadores del Seguro Social.",4]
[2,1,118,"REGLAMENTO DE ACTIVIDADES DEPORTIVAS","S/C",2,"El  Instituto  pagará  los  gastos  de  transporte  que  se requieran para las actividades recreativas y deportivas del Sindicato en todo el sistema de acuerdo a los programas que aprueben conjuntamente.",4]
[3,1,118,"REGLAMENTO DE ACTIVIDADES DEPORTIVAS","S/C",3,"El Instituto proporcionará mantenimiento y conservación a las instalaciones deportivas del Sindicato Nacional de Trabajadores del Seguro Social.",4]
[4,1,118,"REGLAMENTO DE ACTIVIDADES DEPORTIVAS","S/C",4,"El Instituto pagará el costo que originen los recursos humanos asignados a  las instalaciones deportivas dependientes del Sindicato Nacional de Trabajadores del Seguro Social.",4]
[5,1,118,"REGLAMENTO DE ACTIVIDADES DEPORTIVAS","S/C",5,"El Sindicato Nacional de Trabajadores del Seguro Social nominará al Director y Administrador de sus Deportivos.",4]
[6,1,118,"REGLAMENTO DE ACTIVIDADES DEPORTIVAS","S/C",6,"Los requerimientos especiales de usos de instalaciones del Instituto que sean planteados por el Sindicato, deberán convenirse en cada caso, con la Coordinación de Prestaciones Sociales.",4]
{"$rows_left_out":3}
{"sheet":"Reg_Bec_Cap","index":6,"n_rows":11,"n_cols":16,"rows_kept":11,"cut":false,"hidden":false,"merged":[[8,8,8,9],[1,2,3,12],[4,2,5,12],[9,11,9,12],[1,15,37,19],[9,4,9,7],[10,2,10,4],[10,6,10,8],[10,11,10,12],[11,1,37,4],[11,5,37,8],[11,9,37,12],[7,2,7,3],[7,5,7,8],[7,10,7,12],[8,2,8,3],[8,5,8,6]]}
[]
[null,null,"Sindicato Nacional de Trabajadores del Seguro Social\nComité Ejecutivo Nacional",null,null,null,null,null,null,null,null,null,null,null,null,{"$f":"IF(O8=\"\",\"\",VLOOKUP(O8,'Reglamentos H2'!$A$1:$G$1153,7,FALSE))","v":"Para los efectos de este Reglamento, se entenderá por beca, la aportación económica, los permisos con salario, con parte proporcional del mismo o sin salario, y la reducción de jornada sin perjuicio del salario, que otorga el Instituto a los trabajadores a que se refiere la Cláusula 11 del Contrato Colectivo de Trabajo, de conformidad con las disposiciones que se establecen en los siguientes Artículos."}]
[]
[null,null,null,null,null,null,null,null,null,null,null,null,null,null,"SELECCIONA TU  SECCIÓN"]
[null,null,"LXXI Consejo Nacional Ordinario",null,null,null,null,null,null,null,null,null,null,null,39]
[]
{"$rows_left_out":6}
{"sheet":"Reg_Bol_Trab","index":7,"n_rows":11,"n_cols":16,"rows_kept":11,"cut":false,"hidden":false,"merged":[[8,8,8,9],[1,2,3,12],[4,2,5,12],[9,11,9,12],[1,15,37,19],[9,4,9,7],[10,2,10,4],[10,6,10,8],[10,11,10,12],[11,1,37,4],[11,5,37,8],[11,9,37,12],[7,2,7,3],[7,5,7,8],[7,10,7,12],[8,2,8,3],[8,5,8,6]]}
[]
[null,null,"Sindicato Nacional de Trabajadores del Seguro Social\nComité Ejecutivo Nacional",null,null,null,null,null,null,null,null,null,null,null,null,{"$f":"IF(O8=\"\",\"\",VLOOKUP(O8,'Reglamentos H3'!$A$1:$G$1152,7,FALSE))","v":"El ingreso de trabajadores de base, a obra determinada o sustitutos, se hará invariablemente a través de las Bolsas de Trabajo, establecidas en los términos de este Reglamento en todo el sistema."}]
[]
[null,null,null,null,null,null,null,null,null,null,null,null,null,null,"SELECCIONA TU  SECCIÓN"]
[null,null,"LXXI Consejo Nacional Ordinario",null,null,null,null,null,null,null,null,null,null,null,39]
[]
{"$rows_left_out":6}
{"sheet":"Reg_Bol_Trab_IMSSop","index":8,"n_rows":11,"n_cols":16,"rows_kept":11,"cut":false,"hidden":false,"merged":[[8,8,8,9],[1,2,3,12],[4,2,5,12],[9,11,9,12],[1,15,37,19],[9,4,9,7],[10,2,10,4],[10,6,10,8],[10,11,10,12],[11,1,37,4],[11,5,37,8],[11,9,37,12],[7,2,7,3],[7,5,7,8],[7,10,7,12],[8,2,8,3],[8,5,8,6]]}
[]
[null,null,"Sindicato Nacional de Trabajadores del Seguro Social\nComité Ejecutivo Nacional",null,null,null,null,null,null,null,null,null,null,null,null,{"$f":"IF(O8=\"\",\"\",VLOOKUP(O8,'Reglamentos H4'!$A$1:$G$1152,7,FALSE))","v":"El ingreso de trabajadores de base, a obra determinada o sustitutos, se hará invariablemente a través de las Bolsas de Trabajo en donde opera el Programa IMSS-Prospera, establecidas en los términos de este Reglamento."}]
[]
[null,null,null,null,null,null,null,null,null,null,null,null,null,null,"SELECCIONA TU  SECCIÓN"]
[null,null,"LXXI Consejo Nacional Ordinario",null,null,null,null,null,null,null,null,null,null,null,39]
[]
{"$rows_left_out":6}
{"sheet":"Reg_Cal_Conf_B","index":9,"n_rows":11,"n_cols":16,"rows_kept":11,"cut":false,"hidden":false,"merged":[[8,8,8,9],[1,2,3,12],[4,2,5,12],[9,11,9,12],[1,15,37,19],[9,4,9,7],[10,2,10,4],[10,6,10,8],[10,11,10,12],[11,1,37,4],[11,5,37,8],[11,9,37,12],[7,2,7,3],[7,5,7,8],[7,10,7,12],[8,2,8,3],[8,5,8,6]]}
[]
[null,null,"Sindicato Nacional de Trabajadores del Seguro Social\nComité Ejecutivo Nacional",null,null,null,null,null,null,null,null,null,null,null,null,{"$f":"IF(O8=\"\",\"\",VLOOKUP(O8,'Reglamentos H5'!$A$1:$G$1152,7,FALSE))","v":"El   presente  Reglamento,  de   conformidad  con  las Cláusulas 11 y 12 del Contrato Colectivo de Trabajo, determina los lineamientos generales que deben aplicarse para la calificación, selección y ocupación de puestos de Confianza \"B\"."}]
[]
[null,null,null,null,null,null,null,null,null,null,null,null,null,null,"SELECCIONA TU  SECCIÓN"]
[null,null,"LXXI Consejo Nacional Ordinario",null,null,null,null,null,null,null,null,null,null,null,39]
[]
{"$rows_left_out":6}
{"sheet":"Busqueda","index":10,"n_rows":12,"n_cols":16,"rows_kept":12,"cut":false,"hidden":true,"merged":[]}
[]
[]
[]
[]
["CONSULTA"]
["Consecutivo Formatos","Mesa","Seccion","Nombre","Categoria","Matricula","Adscripcion","Capitulo","Ponencia Numero","Clausula","Reglamento","Articulo","Otras Modificaciones","Dice Contenido","Debe Decir Contenido","Justificacion Contenido"]
{"$rows_left_out":7}
{"sheet":"BD_Clausulas","index":11,"n_rows":1,"n_cols":16,"rows_kept":1,"cut":false,"hidden":true,"merged":[]}
["Consecutivo Formatos","Mesa","Seccion","Nombre","Categoria","Matricula","Adscripcion","Capitulo","Ponencia Numero","Clausula","Reglamento","Articulo","Otras Modificaciones","Dice Contenido","Debe Decir Contenido","Justificacion Contenido"]

{"sheet":"BD","index":12,"n_rows":1,"n_cols":16,"rows_kept":1,"cut":false,"hidden":false,"merged":[]}
["Consecutivo Formatos","Mesa","Seccion","Nombre","Categoria","Matricula","Adscripcion","Capitulo","Ponencia Numero","Clausula","Reglamento","Articulo","Otras Modificaciones","Dice Contenido","Debe Decir Contenido","Justificacion Contenido"]

{"sheet":"Consulta","index":13,"n_rows":12,"n_cols":13,"rows_kept":12,"cut":false,"hidden":true,"merged":[[7,2,7,3],[7,5,7,8],[7,10,7,12],[8,2,8,3],[8,5,8,6],[8,8,8,9],[11,1,37,4],[11,5,37,8],[11,9,37,12],[9,2,9,3],[9,5,9,6],[9,8,9,9],[10,2,10,4],[10,6,10,8],[10,11,10,12]]}
[]
[]
[]
[]
[]
[]
{"$rows_left_out":7}
{"sheet":"Secciones","index":14,"n_rows":39,"n_cols":5,"rows_kept":39,"cut":false,"hidden":true,"merged":[]}
[1,"I Puebla"]
[2,"II Nuevo León",null,null,"Otras Modificaciónes"]
[3,"III Jalisco",null,null,"Nueva Cláusula"]
[4,"IV Veracruz Sur",null,null,"Nuevo Catalogo"]
[5,"V Estado de México",null,null,"Nueva Categoria"]
[6,"VI Yucatán",null,null,"Nuevo Artículo"]
{"$rows_left_out":33}